View Single Post
Old 01-08-2008, 02:45 PM   #5
jadar_koal
Lurker
 
Join Date: Jan 2008
Posts: 4
i don't build the botlib, i only build the jk2cgame, jk2game and the ui
the thing is that the jk2game builds succesful but the jk2cgame and the ui don't build cus of some "error LNK2019" thing.
here is what the output screen says when i try to build the jk2cgame:

1>------ Build started: Project: JK2cgame, Configuration: Debug(SH) Win32 ------
1>Linking...
1> Creating library .\../Debug/cgamex86.lib and object .\../Debug/cgamex86.exp
1>cg_players.obj : error LNK2019: unresolved external symbol _max referenced in function _CG_Player
1>cg_view.obj : error LNK2019: unresolved external symbol _powf referenced in function _CG_UpdateThirdPersonTargetDamp
1>..\Debug\cgamex86.dll : fatal error LNK1120: 2 unresolved externals
1>Build log was saved at "file://d:\Programing stuff\ja_sdk\ja_sdk_fixed\codemp\cgame\Debug(SH)\B uildLog.htm"
1>JK2cgame - 3 error(s), 0 warning(s)
========== Build: 0 succeeded, 1 failed, 0 up-to-date, 0 skipped ==========

and when i try to build the ui gives me this:

1>------ Build started: Project: ui, Configuration: Debug(SH) Win32 ------
1>Linking...
1> Creating library .\../Debug/uix86.lib and object .\../Debug/uix86.exp
1>ui_main.obj : error LNK2019: unresolved external symbol _min referenced in function _Text_PaintWithCursor
1>../Debug/uix86.dll : fatal error LNK1120: 1 unresolved externals
1>Build log was saved at "file://d:\Programing stuff\ja_sdk\ja_sdk_fixed\codemp\ui\Debug(SH)\Buil dLog.htm"
1>ui - 2 error(s), 0 warning(s)
========== Build: 0 succeeded, 1 failed, 0 up-to-date, 0 skipped ==========


jadar_koal is offline   you may: quote & reply,